Target
CREB-binding protein
Ligand
BDBM264455
Substrate
Meas. Tech.
AlphaScreen In-Vitro Binding Assay for CREBBP
pH
7.5±n/a
Temperature
298.15±n/a K
IC50
3000±n/a nM
Comments
extracted
Citation
 Blank, JCotesta, SGuagnano, VRueeger, H Pyrazolo-pyrrolidin-4-one derivatives and their use in the treatment of disease US Patent  US9714249 Publication Date 7/25/2017 
Target
Name:
CREB-binding protein
Synonyms:
CBP CREB-binding protein (CBP) CREBBP
Type:
Transcription Coactivator
Mol. Mass.:
265411.66
Organism:
Homo sapiens (Human)
Description:
Q92793
Residue:
2442
  
Inhibitor
Name:
BDBM264455
Synonyms:
6-(4-chlorophenyl)-5-(1,5-dimethyl-6-oxo-1,6-dihydropyridin-3-yl)-1-(6-methoxypyridin-3-yl)-3-methyl-5,6-dihydropyrrolo[3,4-c]pyrazol-4(1H)-one | US9714249, 20b
Type:
Small organic molecule
Emp. Form.:
C25H22ClN5O3
Mol. Mass.:
475.927
SMILES:
COc1ccc(cn1)-n1nc(C)c2C(=O)N([C@@H](c12)c1ccc(Cl)cc1)c1cc(C)c(=O)n(C)c1
: