Target
Bromodomain-containing protein 3
Ligand
BDBM264456
Substrate
Meas. Tech.
TR-FRET In-Vitro Binding Assays for BRD2, BRD3, and BRD4
pH
7.5±n/a
IC50
52.0±n/a nM
Comments
extracted
Citation
 Blank, JCotesta, SGuagnano, VRueeger, H Pyrazolo-pyrrolidin-4-one derivatives and their use in the treatment of disease US Patent  US9714249 Publication Date 7/25/2017 
Target
Name:
Bromodomain-containing protein 3
Synonyms:
BRD3 Bromodomain and extra-terminal motif (BET) Bromodomain-containing protein 3 (BRD3) RING3-like protein | RING3L
Type:
Protein
Mol. Mass.:
79571.81
Organism:
Homo sapiens (Human)
Description:
Q15059
Residue:
726
  
Inhibitor
Name:
BDBM264456
Synonyms:
6-(4-chlorophenyl)-5-(1,5-dimethyl-6-oxo-1,6-dihydropyridin-3-yl)-1-(2-methoxypyrimidin-5-yl)-3-methyl-5,6-dihydropyrrolo[3,4-c]pyrazol-4(1H)-one and | US9714249, 21a
Type:
Small organic molecule
Emp. Form.:
C24H23ClN6O3
Mol. Mass.:
478.931
SMILES:
COc1ncc(NC2=C(C(C)=N)C(=O)N(C2c2ccc(Cl)cc2)c2cc(C)c(=O)n(C)c2)cn1
: