Target
CREB-binding protein
Ligand
BDBM264460
Substrate
Meas. Tech.
AlphaScreen In-Vitro Binding Assay for CREBBP
pH
7.5±n/a
Temperature
298.15±n/a K
IC50
1700±n/a nM
Comments
extracted
Citation
 Blank, JCotesta, SGuagnano, VRueeger, H Pyrazolo-pyrrolidin-4-one derivatives and their use in the treatment of disease US Patent  US9714249 Publication Date 7/25/2017 
Target
Name:
CREB-binding protein
Synonyms:
CBP CREB-binding protein (CBP) CREBBP
Type:
Transcription Coactivator
Mol. Mass.:
265411.66
Organism:
Homo sapiens (Human)
Description:
Q92793
Residue:
2442
  
Inhibitor
Name:
BDBM264460
Synonyms:
(R)-6-(4-chlorophenyl)-3-cyclopropyl-5-(1,5-dimethyl-6-oxo-1,6-dihydropyridin-3-yl)-5,6-dihydropyrrolo[3,4-c]pyrazol-4(1H)-one | US9714249, 24
Type:
Small organic molecule
Emp. Form.:
C21H19ClN4O2
Mol. Mass.:
394.854
SMILES:
Cc1cc(cn(C)c1=O)N1[C@@H](c2[nH]nc(C3CC3)c2C1=O)c1ccc(Cl)cc1
: