Target
Serine/threonine-protein kinase 16
Ligand
BDBM31096
Substrate
Meas. Tech.
Kinase Inhibitor Selectivity Profiling Assay
Kd
270±n/a nM
Citation
 PubChem, PC Kinase Inhibitor Selectivity Profiling Assay PubChem Bioassay (2008)[AID] 
Target
Name:
Serine/threonine-protein kinase 16
Synonyms:
MPSK1 STK16 Serine/threonine-protein kinase 16 Tyrosine-protein kinase STK16 (STK16)
Type:
Protein
Mol. Mass.:
34659.07
Organism:
Homo sapiens (Human)
Description:
Residue:
305
  
Inhibitor
Name:
BDBM31096
Synonyms:
CHEMBL290084 cid_451705
Type:
Small organic molecule
Emp. Form.:
C28H26N4O3
Mol. Mass.:
466.531
SMILES:
CN[C@H]1C[C@@H]2O[C@](C)([C@H]1OC)n1c3ccccc3c3c4CNC(=O)c4c4c5ccccc5n2c4c13
: