Target
Aldo-keto reductase family 1 member C3
Ligand
BDBM264478
Substrate
Meas. Tech.
AKR1C3-Inhibitory Action
pH
7±n/a
IC50
27.0±n/a nM
Comments
extracted
Citation
 Bothe, UBusemann, MBarak, NRotgeri, AFischer, OMMarquardt, T Estra-1,3,5(10),16-tetraene-3-carboxamides for inhibition of 17.beta.-hydroxysteroid dehydrogenase (AKR1C3) US Patent  US9714266 Publication Date 7/25/2017 
Target
Name:
Aldo-keto reductase family 1 member C3
Synonyms:
17-beta-Hydroxysteroid Dehydrogenase 5 (17-beta-HSD5, AKR1C3) AK1C3_HUMAN Aldo-keto reductase family 1 member C3 Aldo-keto reductase family 1 member C3 (AK1C3a) Aldo-keto-reductase family 1 member C3 Dihydrodiol dehydrogenase 3 Estradiol 17-beta-dehydrogenase KIAA0119 Prostaglandin F synthase Trans-1,2-dihydrobenzene-1,2-diol dehydrogenase
Type:
Enzyme
Mol. Mass.:
36859.86
Organism:
Homo sapiens (Human)
Description:
P42330
Residue:
323
  
Inhibitor
Name:
BDBM264478
Synonyms:
11ß-fluoro-17-(5-fluoropyridin-3-yl)oestra-1,3,5(10),16-tetraene-3-carboxamide | US9714266, 7
Type:
Small organic molecule
Emp. Form.:
C24H24F2N2O
Mol. Mass.:
394.457
SMILES:
[H][C@@]12CC=C(c3cncc(F)c3)[C@@]1(C)C[C@H](F)[C@]1([H])c3ccc(cc3CC[C@@]21[H])C(N)=O
: