Target
Aldo-keto reductase family 1 member C3
Ligand
BDBM264510
Substrate
Meas. Tech.
AKR1C3-Inhibitory Action
pH
7±n/a
IC50
5.00±n/a nM
Comments
extracted
Citation
 Bothe, UBusemann, MBarak, NRotgeri, AFischer, OMMarquardt, T Estra-1,3,5(10),16-tetraene-3-carboxamides for inhibition of 17.beta.-hydroxysteroid dehydrogenase (AKR1C3) US Patent  US9714266 Publication Date 7/25/2017 
Target
Name:
Aldo-keto reductase family 1 member C3
Synonyms:
17-beta-Hydroxysteroid Dehydrogenase 5 (17-beta-HSD5, AKR1C3) AK1C3_HUMAN Aldo-keto reductase family 1 member C3 Aldo-keto reductase family 1 member C3 (AK1C3a) Aldo-keto-reductase family 1 member C3 Dihydrodiol dehydrogenase 3 Estradiol 17-beta-dehydrogenase KIAA0119 Prostaglandin F synthase Trans-1,2-dihydrobenzene-1,2-diol dehydrogenase
Type:
Enzyme
Mol. Mass.:
36859.86
Organism:
Homo sapiens (Human)
Description:
P42330
Residue:
323
  
Inhibitor
Name:
BDBM264510
Synonyms:
N-ethyl-17-(5-fluoropyridin-3-yl)oestra-1,3,5(10),16-tetraene-3-carboxamide | US9714266, 39
Type:
Small organic molecule
Emp. Form.:
C26H29FN2O
Mol. Mass.:
404.5197
SMILES:
CCNC(=O)c1ccc2[C@H]3CC[C@@]4(C)[C@@H](CC=C4c4cncc(F)c4)[C@@H]3CCc2c1
: