Target
Gag-Pol polyprotein [600-1027,R876K]/[600-1155]
Ligand
BDBM1615
Substrate
poly(rC):oligo(dG)
Meas. Tech.
HIV-1 RT Assay
IC50
920±n/a nM
Citation
 Kelly, TAProudfoot, JRMcNeil, DWPatel, URDavid, EHargrave, KDGrob, PMCardozo, MAgarwal, AAdams, J Novel non-nucleoside inhibitors of human immunodeficiency virus type 1 reverse transcriptase. 5. 4-Substituted and 2,4-disubstituted analogs of nevirapine. J Med Chem 38:4839-47 (1995)  
Target
Name:
Gag-Pol polyprotein [600-1027,R876K]/[600-1155]
Synonyms:
EC: 2.7.7.49 | HIV-1 Reverse Transcriptase
Type:
Protein Complex
Mol. Mass.:
113858
Description:
Components:
This complex has 2 components.
Component 1
Name:
Gag-Pol polyprotein [600-1155]
Synonyms:
HIV-1 Reverse Transcriptase Chain A gag-pol
Type:
Enzyme Subunit
Mol. Mass.:
63928.81
Organism:
Human immunodeficiency virus type 1
Description:
P03366[600-1155]
Residue:
556
  
Component 2
Name:
Gag-Pol polyprotein [600-1027,R876K]
Synonyms:
HIV-1 Reverse Transcriptase Chain B gag-pol
Type:
Enzyme Subunit
Mol. Mass.:
49968.63
Organism:
Human immunodeficiency virus type 1
Description:
P03366[600-1027,R876K]
Residue:
428
  
Inhibitor
Name:
BDBM1615
Synonyms:
4-[(Benzyloxy)methy1]-5,1 l-dihydro-2-methoxy-6H-dipyrido[3,2-b:2 ,3 -e] [1,4]diazepin-6-one Nevirapin 2,4-Disubstituted deriv. 11b
Type:
Small organic molecule
Emp. Form.:
C22H22N4O3
Mol. Mass.:
390.4351
SMILES:
CCN1c2nc(OC)cc(COCc3ccccc3)c2NC(=O)c2cccnc12
:
Substrate
Name:
poly(rC):oligo(dG)
Synonyms:
Type:
RNA-DNA duplex
Mol. Mass.:
358.43
Organism:
Description:
The incorporation of Tritium-labeled [3H]dGTP onto a (poly)rC:(oligo)dG template:primer.
Residue:
3
NA