Target
Sphingosine 1-phosphate receptor 1
Ligand
BDBM36921
Substrate
Meas. Tech.
Dose Response Assays for S1P1 Agonists and Agonism Potentiators - Potentiator Assay 60K MLSMR
EC50
30580±n/a nM
Citation
 PubChem, PC Dose Response Assays for S1P1 Agonists and Agonism Potentiators - Potentiator Assay 60K MLSMR PubChem Bioassay (2007)[AID] 
Target
Name:
Sphingosine 1-phosphate receptor 1
Synonyms:
CHEDG1 Endothelial differentiation G-protein coupled receptor 1 S1P1 S1PR1_HUMAN Sphingosine 1-phosphate receptor Edg-1
Type:
Enzyme
Mol. Mass.:
42836.02
Organism:
Homo sapiens (Human)
Description:
P21453
Residue:
382
  
Inhibitor
Name:
BDBM36921
Synonyms:
6-cyclohexyl-3-(3-methoxyphenyl)-[1,2,4]triazolo[3,4-b][1,3,4]thiadiazole SMR000043363 | cid_662755
Type:
Small organic molecule
Emp. Form.:
C16H18N4OS
Mol. Mass.:
314.405
SMILES:
COc1cccc(c1)-c1nnc2sc(nn12)C1CCCCC1
: