Target
Sphingosine 1-phosphate receptor 1
Ligand
BDBM36952
Substrate
Meas. Tech.
Dose Response Assays for S1P1 Agonists and Agonism Potentiators - Potentiator Assay 60K MLSMR
EC50
770±n/a nM
Citation
 PubChem, PC Dose Response Assays for S1P1 Agonists and Agonism Potentiators - Potentiator Assay 60K MLSMR PubChem Bioassay (2007)[AID] 
Target
Name:
Sphingosine 1-phosphate receptor 1
Synonyms:
CHEDG1 Endothelial differentiation G-protein coupled receptor 1 S1P1 S1PR1_HUMAN Sphingosine 1-phosphate receptor Edg-1
Type:
Enzyme
Mol. Mass.:
42836.02
Organism:
Homo sapiens (Human)
Description:
P21453
Residue:
382
  
Inhibitor
Name:
BDBM36952
Synonyms:
3-(4-ethoxy-3-methoxy-phenyl)-5-(3-pyridyl)-1,2,4-oxadiazole 3-(4-ethoxy-3-methoxyphenyl)-5-(3-pyridinyl)-1,2,4-oxadiazole MLS000083724 cid_666153
Type:
Small organic molecule
Emp. Form.:
C16H15N3O3
Mol. Mass.:
297.3086
SMILES:
CCOc1ccc(cc1OC)-c1noc(n1)-c1cccnc1
: