Target
Sphingosine 1-phosphate receptor 1
Ligand
BDBM36978
Substrate
Meas. Tech.
Dose Response Assays for S1P1 Agonists and Agonism Potentiators - Potentiator Assay 60K MLSMR
EC50
7981±n/a nM
Citation
 PubChem, PC Dose Response Assays for S1P1 Agonists and Agonism Potentiators - Potentiator Assay 60K MLSMR PubChem Bioassay (2007)[AID] 
Target
Name:
Sphingosine 1-phosphate receptor 1
Synonyms:
CHEDG1 Endothelial differentiation G-protein coupled receptor 1 S1P1 S1PR1_HUMAN Sphingosine 1-phosphate receptor Edg-1
Type:
Enzyme
Mol. Mass.:
42836.02
Organism:
Homo sapiens (Human)
Description:
P21453
Residue:
382
  
Inhibitor
Name:
BDBM36978
Synonyms:
3,5-dimethyl-4-isoxazolecarboxylic acid [2-[2,5-dimethyl-1-(4-methylphenyl)-3-pyrrolyl]-2-oxoethyl] ester MLS000053925 [2-[2,5-dimethyl-1-(4-methylphenyl)pyrrol-3-yl]-2-oxidanylidene-ethyl] 3,5-dimethyl-1,2-oxazole-4-carboxylate cid_2998213
Type:
Small organic molecule
Emp. Form.:
C21H22N2O4
Mol. Mass.:
366.4104
SMILES:
Cc1cc(C(=O)COC(=O)c2c(C)noc2C)c(C)n1-c1ccc(C)cc1
: