Target
Sphingosine 1-phosphate receptor 1
Ligand
BDBM31072
Substrate
Meas. Tech.
Dose Response Assays for S1P1 Agonists and Agonism Potentiators - Potentiator Assay 60K MLSMR
EC50
23510±n/a nM
Citation
 PubChem, PC Dose Response Assays for S1P1 Agonists and Agonism Potentiators - Potentiator Assay 60K MLSMR PubChem Bioassay (2007)[AID] 
Target
Name:
Sphingosine 1-phosphate receptor 1
Synonyms:
CHEDG1 Endothelial differentiation G-protein coupled receptor 1 S1P1 S1PR1_HUMAN Sphingosine 1-phosphate receptor Edg-1
Type:
Enzyme
Mol. Mass.:
42836.02
Organism:
Homo sapiens (Human)
Description:
P21453
Residue:
382
  
Inhibitor
Name:
BDBM31072
Synonyms:
2-[(1,1-dioxido-1-benzothien-3-yl)thio]-5-phenyl-1,3,4-oxadiazole 3-[(5-phenyl-1,3,4-oxadiazol-2-yl)thio]-1-benzothiophene 1,1-dioxide MLS000088644 cid_890649
Type:
Small organic molecule
Emp. Form.:
C16H10N2O3S2
Mol. Mass.:
342.392
SMILES:
O=S1(=O)C=C(Sc2nnc(o2)-c2ccccc2)c2ccccc12
: