Target
Gamma-aminobutyric acid (GABA) B receptor 1
Ligand
BDBM403366
Substrate
Meas. Tech.
Steroid Inhibition of TBPS Binding
IC50
30±n/a nM
Citation
 Robichaud, AJSalituro, FGHarrison, BLMartinez Botella, G Neuroactive steroids, compositions, and uses thereof US Patent  US10329320 Publication Date 6/25/2019 
Target
Name:
Gamma-aminobutyric acid (GABA) B receptor 1
Synonyms:
GABA-B receptor 1 Gamma-aminobutyric acid type B receptor subunit 1 (GABA) gamma-Aminobutyric Acid Type B Receptor Subunit 1
Type:
G Protein-Coupled Receptor (GPCR)
Mol. Mass.:
108221.06
Organism:
Rattus norvegicus (rat)
Description:
Q6MFX8
Residue:
960
  
Inhibitor
Name:
BDBM403366
Synonyms:
US10329320, Compound 47
Type:
Small organic molecule
Emp. Form.:
C29H41N3O3
Mol. Mass.:
479.6541
SMILES:
COC[C@]12CC[C@@](C)(O)C[C@@H]1CC[C@H]1[C@@H]3CC[C@H](C(=O)Cn4ncc5cccnc45)[C@@]3(C)CC[C@H]21
: