Target
Discoidin domain-containing receptor 2
Ligand
BDBM185590
Substrate
Meas. Tech.
FMS, DDR1 and DDR2 Kinases Activity
IC50
181±n/a nM
Citation
 Bae, IHSon, JBHan, SMKwak, EJKim, HSSong, JYByun, EYJun, SAAhn, YGSuh, KH Thieno[3,2-D]pyrimidine derivatives having inhibitory activity for protein kinases US Patent  USRE47451 Publication Date 6/25/2019 
Target
Name:
Discoidin domain-containing receptor 2
Synonyms:
DDR2 Discoidin domain receptor 2 (DDR2) Discoidin domain-containing receptor 2 (DDR2) NTRKR3 TYRO10
Type:
Protein
Mol. Mass.:
96717.07
Organism:
Homo sapiens (Human)
Description:
Q16832
Residue:
855
  
Inhibitor
Name:
BDBM185590
Synonyms:
US9156852, 105 | USRE47451, Example 105
Type:
Small organic molecule
Emp. Form.:
C23H16ClFN6OS
Mol. Mass.:
478.929
SMILES:
Cc1ccc2c(Nc3ccc(F)c(Cl)c3)nccc2c1NC(=O)c1csc2c(N)ncnc12
: