Target
Metabotropic glutamate receptor 2
Ligand
BDBM403442
Substrate
Meas. Tech.
Biological Assays
IC50
>3000±n/a nM
Citation
 Sebhat, IKArasappan, AHoyt, SBWilkening, RRDeMong, D Chromane, isochromane and dihydroisobenzofuran derivatives as mGluR2—negative allosteric modulators, compositions, and their use US Patent  US10335399 Publication Date 7/2/2019 
Target
Name:
Metabotropic glutamate receptor 2
Synonyms:
GPRC1B GRM2_HUMAN Metabotropic glutamate receptor mGlu2 | metabotropic glutamate 2
Type:
Enzyme
Mol. Mass.:
95584.88
Organism:
Homo sapiens (Human)
Description:
Q14416
Residue:
872
  
Inhibitor
Name:
BDBM403442
Synonyms:
(6R,9S)- or (6S,9R)- 4-(1-methyl-1H- pyrazol-4-yl)-6,7,8,9- tetrahydro-5H-6,9- epoxycyclo- hepta[b]pyridine-2- carboxamide US10806724, Example 1-4A
Type:
Small organic molecule
Emp. Form.:
C15H16N4O2
Mol. Mass.:
284.3131
SMILES:
Cn1cc(cn1)-c1cc(nc2[C@@H]3CC[C@H](Cc12)O3)C(N)=O
: