Target
Metabotropic glutamate receptor 2
Ligand
BDBM403471
Substrate
Meas. Tech.
Biological Assays
IC50
19.0±n/a nM
Citation
 Sebhat, IKArasappan, AHoyt, SBWilkening, RRDeMong, D Chromane, isochromane and dihydroisobenzofuran derivatives as mGluR2—negative allosteric modulators, compositions, and their use US Patent  US10335399 Publication Date 7/2/2019 
Target
Name:
Metabotropic glutamate receptor 2
Synonyms:
GPRC1B GRM2_HUMAN Metabotropic glutamate receptor mGlu2 | metabotropic glutamate 2
Type:
Enzyme
Mol. Mass.:
95584.88
Organism:
Homo sapiens (Human)
Description:
Q14416
Residue:
872
  
Inhibitor
Name:
BDBM403471
Synonyms:
US10335399, Example 3-1B | US10806724, Example 3-1B
Type:
Small organic molecule
Emp. Form.:
C17H14F4N2O3
Mol. Mass.:
370.2983
SMILES:
NC(=O)c1cc(c2CC[C@@H](COC(F)F)Oc2n1)-c1ccc(F)cc1F
: