Target
Metabotropic glutamate receptor 2
Ligand
BDBM403490
Substrate
Meas. Tech.
Biological Assays
IC50
25.0±n/a nM
Citation
 Sebhat, IKArasappan, AHoyt, SBWilkening, RRDeMong, D Chromane, isochromane and dihydroisobenzofuran derivatives as mGluR2—negative allosteric modulators, compositions, and their use US Patent  US10335399 Publication Date 7/2/2019 
Target
Name:
Metabotropic glutamate receptor 2
Synonyms:
GPRC1B GRM2_HUMAN Metabotropic glutamate receptor mGlu2 | metabotropic glutamate 2
Type:
Enzyme
Mol. Mass.:
95584.88
Organism:
Homo sapiens (Human)
Description:
Q14416
Residue:
872
  
Inhibitor
Name:
BDBM403490
Synonyms:
US10335399, Example 4-1A | US10806724, Example 4-1A
Type:
Small organic molecule
Emp. Form.:
C19H18F5N3O2
Mol. Mass.:
415.3571
SMILES:
CN(C[C@H]1CCc2c(O1)nc(cc2-c1ccc(F)cc1F)C(N)=O)CC(F)(F)F
: