Target
Prokineticin receptor 1
Ligand
BDBM349644
Substrate
Meas. Tech.
BIOLOGICAL ASSAY
IC50
760±n/a nM
Citation
 Mitchell, PTeall, M Sulfonyl piperidine derivatives and their use for treating prokineticin mediated gastrointestinal disorders US Patent  US10335402 Publication Date 7/2/2019 
Target
Name:
Prokineticin receptor 1
Synonyms:
G-protein coupled receptor 73 GPR73 PK-R1 PKR1_HUMAN | PROKR1
Type:
enzyme
Mol. Mass.:
44779.92
Organism:
Homo sapiens (Human)
Description:
Q8TCW9
Residue:
393
  
Inhibitor
Name:
BDBM349644
Synonyms:
4-(4-Chlorobenzylidene)-1-((3,5-dimethyl-1H-pyrazol-4-yl) sulfonyl)piperidine US10335402, Example 14
Type:
Small organic molecule
Emp. Form.:
C17H20ClN3O2S
Mol. Mass.:
365.878
SMILES:
Cc1n[nH]c(C)c1S(=O)(=O)N1CCC(CC1)=Cc1ccc(Cl)cc1
: