Target
Prokineticin receptor 1
Ligand
BDBM349647
Substrate
Meas. Tech.
BIOLOGICAL ASSAY
IC50
1880±n/a nM
Citation
 Mitchell, PTeall, M Sulfonyl piperidine derivatives and their use for treating prokineticin mediated gastrointestinal disorders US Patent  US10335402 Publication Date 7/2/2019 
Target
Name:
Prokineticin receptor 1
Synonyms:
G-protein coupled receptor 73 GPR73 PK-R1 PKR1_HUMAN | PROKR1
Type:
enzyme
Mol. Mass.:
44779.92
Organism:
Homo sapiens (Human)
Description:
Q8TCW9
Residue:
393
  
Inhibitor
Name:
BDBM349647
Synonyms:
4-((3-Chloro-4-fluorophenyl)fluoromethylene)-1-((3,5-dimethyl-1H-pyrazol-4-yl)sulfonyl) piperidine US10335402, Example 17
Type:
Small organic molecule
Emp. Form.:
C17H18ClF2N3O2S
Mol. Mass.:
401.859
SMILES:
Cc1n[nH]c(C)c1S(=O)(=O)N1CCC(CC1)=C(F)c1ccc(F)c(Cl)c1
: