Target
Genome polyprotein
Ligand
BDBM403624
Substrate
Meas. Tech.
Ki Determination for Genotypes 1b and 3a NS3 Protease
Ki
0.280±n/a nM
Citation
 Bjornson, KCanales, ECottell, JJKarki, KKKatana, AAKato, DKobayashi, TLink, JOMartinez, RPhillips, BWPyun, HSangi, MSchrier, AJSiegel, DTaylor, JGTran, CVTrejo Martin, TAVivian, RWYang, ZZablocki, JZipfel, S Inhibitors of hepatitis C virus US Patent  US10335409 Publication Date 7/2/2019 
Target
Name:
Genome polyprotein
Synonyms:
HCV 3a POLG_HCVK3
Type:
Enzyme Catalytic Domain
Mol. Mass.:
328455.91
Organism:
Hepatitis C virus genotype 3a (isolate k3a) (HCV)
Description:
Q81495
Residue:
3021
  
Inhibitor
Name:
BDBM403624
Synonyms:
(1aR,5S,8S,9S,10R,22aR)-5-tert-butyl-N-{(1R,2R)-1-[(cyclopropylsulfonyl)carbamoyl]-2-ethylcyclopropyl}-9-ethyl-18,18-difluoro-14-methoxy-3,6-dioxo-1,1a,3,4,5,6,9,10,18,19,20,21,22,22a-tetradecahydro-8H-7,10-methanocyclopropa[18,19][1,10,3,6]dioxadiazacyclononadecino[11,12-b]quinoxaline-8-carboxamide | US10335409, Example 34
Type:
Small organic molecule
Emp. Form.:
C40H54F2N6O9S
Mol. Mass.:
832.953
SMILES:
CC[C@@H]1C[C@]1(NC(=O)[C@@H]1[C@H](CC)[C@@H]2CN1C(=O)[C@@H](NC(=O)O[C@@H]1C[C@H]1CCCCC(F)(F)c1nc3ccc(OC)cc3nc1O2)C(C)(C)C)C(=O)NS(=O)(=O)C1CC1
: