Target
Genome polyprotein
Ligand
BDBM403631
Substrate
Meas. Tech.
Ki Determination for Genotypes 1b and 3a NS3 Protease
Ki
0.180±n/a nM
Citation
 Bjornson, KCanales, ECottell, JJKarki, KKKatana, AAKato, DKobayashi, TLink, JOMartinez, RPhillips, BWPyun, HSangi, MSchrier, AJSiegel, DTaylor, JGTran, CVTrejo Martin, TAVivian, RWYang, ZZablocki, JZipfel, S Inhibitors of hepatitis C virus US Patent  US10335409 Publication Date 7/2/2019 
Target
Name:
Genome polyprotein
Synonyms:
HCV Polymerase (S282T) NS3/4A Protein POLG_HCVJA
Type:
Protein
Mol. Mass.:
327076.78
Organism:
Hepatitis C Virus (Virus)
Description:
P26662
Residue:
3010
  
Inhibitor
Name:
BDBM403631
Synonyms:
(3aR,7S,10S,11S,12R,24aR)-7-tert-butyl-N-[(1R,2S)-2-(2,2-difluoroethyl)-1-{[(1-methylcyclopropyl)sulfonyl]carbamoyl}cyclopropyl]-11-ethyl-16-methoxy-3a-methyl-5,8-dioxo-1,2,3,3a,5,6,7,8,11,12,20,21,22,23,24,24a-hexadecahydro-10H-9,12-methanocyclopenta[18,19][1,10,3,6]dioxadiazacyclononadecino[11,12-b]quinoxaline-10-carboxamide | US10335409, Example 41
Type:
Small organic molecule
Emp. Form.:
C44H62F2N6O9S
Mol. Mass.:
889.06
SMILES:
CC[C@@H]1[C@@H]2CN(C1C(=O)N[C@@]1(C[C@H]1CC(F)F)C(=O)NS(=O)(=O)C1(C)CC1)C(=O)[C@@H](NC(=O)O[C@]1(C)CCC[C@H]1CCCCCc1nc3ccc(OC)cc3nc1O2)C(C)(C)C
: