Target
Sphingosine 1-phosphate receptor 3
Ligand
BDBM30771
Substrate
Meas. Tech.
S1P3 Agonist Dose-Response Potency Assay
EC50
19100±n/a nM
Citation
 PubChem, PC S1P3 Agonist Dose-Response Potency Assay PubChem Bioassay (2007)[AID] 
Target
Name:
Sphingosine 1-phosphate receptor 3
Synonyms:
C9orf108 EDG3 S1P receptor 3 S1P3 S1PR3_HUMAN Sphingosine 1-phosphate receptor 3 (S1P3) | Sphingosine 1-phosphate receptor Edg-3
Type:
G Protein-Coupled Receptor (GPCR)
Mol. Mass.:
42278.13
Organism:
Homo sapiens (Human)
Description:
Q99500
Residue:
378
  
Inhibitor
Name:
BDBM30771
Synonyms:
2-amino-1-(3-morpholinopropyl)-N-piperonyl-pyrrolo[3,2-b]quinoxaline-3-carboxamide 2-amino-N-(1,3-benzodioxol-5-ylmethyl)-1-[3-(4-morpholinyl)propyl]-3-pyrrolo[3,2-b]quinoxalinecarboxamide MLS000040782 cid_663945
Type:
Small organic molecule
Emp. Form.:
C26H28N6O4
Mol. Mass.:
488.5383
SMILES:
Nc1c(C(=O)NCc2ccc3OCOc3c2)c2nc3ccccc3nc2n1CCCN1CCOCC1
: