Target
Sphingosine 1-phosphate receptor 3
Ligand
BDBM37327
Substrate
Meas. Tech.
S1P3 Agonist Dose-Response Potency Assay
EC50
23500±n/a nM
Citation
 PubChem, PC S1P3 Agonist Dose-Response Potency Assay PubChem Bioassay (2007)[AID] 
Target
Name:
Sphingosine 1-phosphate receptor 3
Synonyms:
C9orf108 EDG3 S1P receptor 3 S1P3 S1PR3_HUMAN Sphingosine 1-phosphate receptor 3 (S1P3) | Sphingosine 1-phosphate receptor Edg-3
Type:
G Protein-Coupled Receptor (GPCR)
Mol. Mass.:
42278.13
Organism:
Homo sapiens (Human)
Description:
Q99500
Residue:
378
  
Inhibitor
Name:
BDBM37327
Synonyms:
3-[[(5-keto-4-propyl-[1,2,4]triazolo[4,3-a]quinazolin-1-yl)thio]methyl]coumarilic acid ethyl ester MLS000098419 cid_2493161 ethyl 3-[(5-oxo-4-propyl-[1,2,4]triazolo[4,3-a]quinazolin-1-yl)sulfanylmethyl]-1-benzofuran-2-carboxylate
Type:
Small organic molecule
Emp. Form.:
C24H22N4O4S
Mol. Mass.:
462.521
SMILES:
CCCn1c2nnc(SCc3c(oc4ccccc34)C(=O)OCC)n2c2ccccc2c1=O
: