Target
Sphingosine 1-phosphate receptor 3
Ligand
BDBM37329
Substrate
Meas. Tech.
S1P3 Agonist Dose-Response Potency Assay
EC50
18600±n/a nM
Citation
 PubChem, PC S1P3 Agonist Dose-Response Potency Assay PubChem Bioassay (2007)[AID] 
Target
Name:
Sphingosine 1-phosphate receptor 3
Synonyms:
C9orf108 EDG3 S1P receptor 3 S1P3 S1PR3_HUMAN Sphingosine 1-phosphate receptor 3 (S1P3) | Sphingosine 1-phosphate receptor Edg-3
Type:
G Protein-Coupled Receptor (GPCR)
Mol. Mass.:
42278.13
Organism:
Homo sapiens (Human)
Description:
Q99500
Residue:
378
  
Inhibitor
Name:
BDBM37329
Synonyms:
1-[1-[2-(4-methoxyphenyl)ethyl]-2,5-dimethyl-3-pyrrolyl]-2-[(1-methyl-5-tetrazolyl)thio]ethanone 1-[1-[2-(4-methoxyphenyl)ethyl]-2,5-dimethyl-pyrrol-3-yl]-2-[(1-methyltetrazol-5-yl)thio]ethanone MLS000054327 cid_2999455
Type:
Small organic molecule
Emp. Form.:
C19H23N5O2S
Mol. Mass.:
385.483
SMILES:
COc1ccc(CCn2c(C)cc(C(=O)CSc3nnnn3C)c2C)cc1
: