Target
Sphingosine 1-phosphate receptor 1
Ligand
BDBM36963
Substrate
Meas. Tech.
Dose Response Assays for S1P1 Agonists and Agonism Potentiators - Parental Cell Line Counter Screen 60K MLSMR
EC50
>95100±n/a nM
Citation
 PubChem, PC Dose Response Assays for S1P1 Agonists and Agonism Potentiators - Parental Cell Line Counter Screen 60K MLSMR PubChem Bioassay (2007)[AID] 
Target
Name:
Sphingosine 1-phosphate receptor 1
Synonyms:
CHEDG1 Endothelial differentiation G-protein coupled receptor 1 S1P1 S1PR1_HUMAN Sphingosine 1-phosphate receptor Edg-1
Type:
Enzyme
Mol. Mass.:
42836.02
Organism:
Homo sapiens (Human)
Description:
P21453
Residue:
382
  
Inhibitor
Name:
BDBM36963
Synonyms:
MLS000042482 N-[2-(3-bromo-4-methoxy-phenyl)-1,3-benzoxazol-5-yl]butyramide SMR000048709 | cid_667358
Type:
Small organic molecule
Emp. Form.:
C18H17BrN2O3
Mol. Mass.:
389.243
SMILES:
CCCC(=O)Nc1ccc2oc(nc2c1)-c1ccc(OC)c(Br)c1
: