Target
Sphingosine 1-phosphate receptor 1
Ligand
BDBM30898
Substrate
Meas. Tech.
Dose Response Assays for S1P1 Agonists and Agonism Potentiators - Parental Cell Line Counter Screen 60K MLSMR
EC50
21300±n/a nM
Citation
 PubChem, PC Dose Response Assays for S1P1 Agonists and Agonism Potentiators - Parental Cell Line Counter Screen 60K MLSMR PubChem Bioassay (2007)[AID] 
Target
Name:
Sphingosine 1-phosphate receptor 1
Synonyms:
CHEDG1 Endothelial differentiation G-protein coupled receptor 1 S1P1 S1PR1_HUMAN Sphingosine 1-phosphate receptor Edg-1
Type:
Enzyme
Mol. Mass.:
42836.02
Organism:
Homo sapiens (Human)
Description:
P21453
Residue:
382
  
Inhibitor
Name:
BDBM30898
Synonyms:
4-(4-piperonylpiperazino)benzofuro[3,2-d]pyrimidine 4-[4-(1,3-benzodioxol-5-ylmethyl)-1-piperazinyl]benzofuro[3,2-d]pyrimidine MLS000064155 cid_2952584
Type:
Small organic molecule
Emp. Form.:
C22H20N4O3
Mol. Mass.:
388.4192
SMILES:
C(N1CCN(CC1)c1ncnc2c3ccccc3oc12)c1ccc2OCOc2c1
: