Target
Sphingosine 1-phosphate receptor 1
Ligand
BDBM36824
Substrate
Meas. Tech.
Dose Response Assays for S1P1 Agonists and Agonism Potentiators - Agonist Assay 60K MLSMR
EC50
6731±n/a nM
Citation
 PubChem, PC Dose Response Assays for S1P1 Agonists and Agonism Potentiators - Agonist Assay 60K MLSMR PubChem Bioassay (2007)[AID] 
Target
Name:
Sphingosine 1-phosphate receptor 1
Synonyms:
CHEDG1 Endothelial differentiation G-protein coupled receptor 1 S1P1 S1PR1_HUMAN Sphingosine 1-phosphate receptor Edg-1
Type:
Enzyme
Mol. Mass.:
42836.02
Organism:
Homo sapiens (Human)
Description:
P21453
Residue:
382
  
Inhibitor
Name:
BDBM36824
Synonyms:
1-(4-Ethoxy-benzenesulfonyl)-5,6-dimethyl-1H-benzoimidazole 1-(4-ethoxyphenyl)sulfonyl-5,6-dimethylbenzimidazole MLS000073166 cid_645879
Type:
Small organic molecule
Emp. Form.:
C17H18N2O3S
Mol. Mass.:
330.401
SMILES:
CCOc1ccc(cc1)S(=O)(=O)n1cnc2cc(C)c(C)cc12
: