Target
Sphingosine 1-phosphate receptor 1
Ligand
BDBM36912
Substrate
Meas. Tech.
Dose Response Assays for S1P1 Agonists and Agonism Potentiators - Agonist Assay 60K MLSMR
EC50
7290±n/a nM
Citation
 PubChem, PC Dose Response Assays for S1P1 Agonists and Agonism Potentiators - Agonist Assay 60K MLSMR PubChem Bioassay (2007)[AID] 
Target
Name:
Sphingosine 1-phosphate receptor 1
Synonyms:
CHEDG1 Endothelial differentiation G-protein coupled receptor 1 S1P1 S1PR1_HUMAN Sphingosine 1-phosphate receptor Edg-1
Type:
Enzyme
Mol. Mass.:
42836.02
Organism:
Homo sapiens (Human)
Description:
P21453
Residue:
382
  
Inhibitor
Name:
BDBM36912
Synonyms:
1-(2-methoxyphenyl)-2-[6-[(4-methylphenyl)sulfanylmethyl]-4-oxidanylidene-1H-pyrimidin-2-yl]guanidine 1-(2-methoxyphenyl)-2-[6-[[(4-methylphenyl)thio]methyl]-4-oxo-1H-pyrimidin-2-yl]guanidine MLS000078736 cid_5587117
Type:
Small organic molecule
Emp. Form.:
C20H21N5O2S
Mol. Mass.:
395.478
SMILES:
COc1ccccc1N=C(N)Nc1nc(CSc2ccc(C)cc2)cc(=O)[nH]1
: