Target
Sphingosine 1-phosphate receptor 3
Ligand
BDBM37378
Substrate
Meas. Tech.
Dose Response Assay for S1P3 Antagonists
IC50
>49800±n/a nM
Citation
 PubChem, PC Dose Response Assay for S1P3 Antagonists PubChem Bioassay (2007)[AID] 
Target
Name:
Sphingosine 1-phosphate receptor 3
Synonyms:
C9orf108 EDG3 S1P receptor 3 S1P3 S1PR3_HUMAN Sphingosine 1-phosphate receptor 3 (S1P3) | Sphingosine 1-phosphate receptor Edg-3
Type:
G Protein-Coupled Receptor (GPCR)
Mol. Mass.:
42278.13
Organism:
Homo sapiens (Human)
Description:
Q99500
Residue:
378
  
Inhibitor
Name:
BDBM37378
Synonyms:
7-methyl-2-(4-methyl-2-pyridinyl)-1-(3,4,5-trimethoxyphenyl)-1H-[1]benzopyrano[2,3-c]pyrrole-3,9-dione 7-methyl-2-(4-methylpyridin-2-yl)-1-(3,4,5-trimethoxyphenyl)-1H-chromeno[2,3-c]pyrrole-3,9-dione SMR000044318 | cid_663659
Type:
Small organic molecule
Emp. Form.:
C27H24N2O6
Mol. Mass.:
472.4893
SMILES:
COc1cc(cc(OC)c1OC)C1N(C(=O)c2oc3ccc(C)cc3c(=O)c12)c1cc(C)ccn1
: