Target
Sphingosine 1-phosphate receptor 3
Ligand
BDBM31060
Substrate
Meas. Tech.
Dose Response Assay for S1P3 Antagonists
IC50
>49800±n/a nM
Citation
 PubChem, PC Dose Response Assay for S1P3 Antagonists PubChem Bioassay (2007)[AID] 
Target
Name:
Sphingosine 1-phosphate receptor 3
Synonyms:
C9orf108 EDG3 S1P receptor 3 S1P3 S1PR3_HUMAN Sphingosine 1-phosphate receptor 3 (S1P3) | Sphingosine 1-phosphate receptor Edg-3
Type:
G Protein-Coupled Receptor (GPCR)
Mol. Mass.:
42278.13
Organism:
Homo sapiens (Human)
Description:
Q99500
Residue:
378
  
Inhibitor
Name:
BDBM31060
Synonyms:
1-cyclopentyl-3-(1-methyl-2-benzimidazolyl)-2-pyrrolo[3,2-b]quinoxalinamine MLS000083448 [1-cyclopentyl-3-(1-methylbenzimidazol-2-yl)pyrrolo[3,2-b]quinoxalin-2-yl]amine | cid_666746
Type:
Small organic molecule
Emp. Form.:
C23H22N6
Mol. Mass.:
382.461
SMILES:
Cn1c(nc2ccccc12)-c1c(N)n(C2CCCC2)c2nc3ccccc3nc12
: