Target
Sphingosine 1-phosphate receptor 3
Ligand
BDBM37403
Substrate
Meas. Tech.
Dose Response Assay for S1P3 Antagonists
IC50
>49800±n/a nM
Citation
 PubChem, PC Dose Response Assay for S1P3 Antagonists PubChem Bioassay (2007)[AID] 
Target
Name:
Sphingosine 1-phosphate receptor 3
Synonyms:
C9orf108 EDG3 S1P receptor 3 S1P3 S1PR3_HUMAN Sphingosine 1-phosphate receptor 3 (S1P3) | Sphingosine 1-phosphate receptor Edg-3
Type:
G Protein-Coupled Receptor (GPCR)
Mol. Mass.:
42278.13
Organism:
Homo sapiens (Human)
Description:
Q99500
Residue:
378
  
Inhibitor
Name:
BDBM37403
Synonyms:
3-(2-furyl)-N-homoveratryl-3-[(4-methoxyphenyl)sulfonylamino]propionamide N-[2-(3,4-dimethoxyphenyl)ethyl]-3-(2-furanyl)-3-[(4-methoxyphenyl)sulfonylamino]propanamide N-[2-(3,4-dimethoxyphenyl)ethyl]-3-(furan-2-yl)-3-[(4-methoxyphenyl)sulfonylamino]propanamide cid_3237859
Type:
Small organic molecule
Emp. Form.:
C24H28N2O7S
Mol. Mass.:
488.553
SMILES:
COc1ccc(cc1)S(=O)(=O)NC(CC(=O)NCCc1ccc(OC)c(OC)c1)c1ccco1
: