Target
Sphingosine 1-phosphate receptor 3
Ligand
BDBM37404
Substrate
Meas. Tech.
Dose Response Assay for S1P3 Antagonists
IC50
18770±n/a nM
Citation
 PubChem, PC Dose Response Assay for S1P3 Antagonists PubChem Bioassay (2007)[AID] 
Target
Name:
Sphingosine 1-phosphate receptor 3
Synonyms:
C9orf108 EDG3 S1P receptor 3 S1P3 S1PR3_HUMAN Sphingosine 1-phosphate receptor 3 (S1P3) | Sphingosine 1-phosphate receptor Edg-3
Type:
G Protein-Coupled Receptor (GPCR)
Mol. Mass.:
42278.13
Organism:
Homo sapiens (Human)
Description:
Q99500
Residue:
378
  
Inhibitor
Name:
BDBM37404
Synonyms:
MLS000085111 N-[4,5-dimethyl-3-[[4-(2-pyridinyl)-1-piperazinyl]methyl]-2-thiophenyl]-2-furancarboxamide N-{4,5-dimethyl-3-[(4-pyridin-2-ylpiperazin-1-yl)methyl]thien-2-yl}-2-furamide cid_1187950
Type:
Small organic molecule
Emp. Form.:
C21H24N4O2S
Mol. Mass.:
396.506
SMILES:
Cc1sc(NC(=O)c2ccco2)c(CN2CCN(CC2)c2ccccn2)c1C
: