Target
Sphingosine 1-phosphate receptor 3
Ligand
BDBM37434
Substrate
Meas. Tech.
Dose Response Assay for S1P3 Antagonists
IC50
8565±n/a nM
Citation
 PubChem, PC Dose Response Assay for S1P3 Antagonists PubChem Bioassay (2007)[AID] 
Target
Name:
Sphingosine 1-phosphate receptor 3
Synonyms:
C9orf108 EDG3 S1P receptor 3 S1P3 S1PR3_HUMAN Sphingosine 1-phosphate receptor 3 (S1P3) | Sphingosine 1-phosphate receptor Edg-3
Type:
G Protein-Coupled Receptor (GPCR)
Mol. Mass.:
42278.13
Organism:
Homo sapiens (Human)
Description:
Q99500
Residue:
378
  
Inhibitor
Name:
BDBM37434
Synonyms:
2-[(1-bicyclo[2.2.1]hept-2-yl-1H-tetrazol-5-yl)thio]-N-4-quinolinylacetamide 2-[[1-(2-norbornyl)tetrazol-5-yl]thio]-N-(4-quinolyl)acetamide 2-[[1-(3-bicyclo[2.2.1]heptanyl)-5-tetrazolyl]thio]-N-(4-quinolinyl)acetamide SMR000079553 | cid_2967368
Type:
Small organic molecule
Emp. Form.:
C19H20N6OS
Mol. Mass.:
380.467
SMILES:
[H]C12CCC([H])(C1)C(C2)n1nnnc1SCC(=O)Nc1ccnc2ccccc12
: