Target
Sphingosine 1-phosphate receptor 3
Ligand
BDBM37461
Substrate
Meas. Tech.
Dose Response Assay for S1P3 Antagonists
IC50
14110±n/a nM
Citation
 PubChem, PC Dose Response Assay for S1P3 Antagonists PubChem Bioassay (2007)[AID] 
Target
Name:
Sphingosine 1-phosphate receptor 3
Synonyms:
C9orf108 EDG3 S1P receptor 3 S1P3 S1PR3_HUMAN Sphingosine 1-phosphate receptor 3 (S1P3) | Sphingosine 1-phosphate receptor Edg-3
Type:
G Protein-Coupled Receptor (GPCR)
Mol. Mass.:
42278.13
Organism:
Homo sapiens (Human)
Description:
Q99500
Residue:
378
  
Inhibitor
Name:
BDBM37461
Synonyms:
2-propan-2-yloxyethyl 6-(furan-2-yl)-3-methyl-4-oxidanylidene-1,5,6,7-tetrahydroindole-2-carboxylate 6-(2-furanyl)-3-methyl-4-oxo-1,5,6,7-tetrahydroindole-2-carboxylic acid 2-propan-2-yloxyethyl ester MLS000116497 cid_5307805
Type:
Small organic molecule
Emp. Form.:
C19H23NO5
Mol. Mass.:
345.3896
SMILES:
CC(C)OCCOC(=O)c1[nH]c2CC(CC(=O)c2c1C)c1ccco1
: