Target
Sphingosine 1-phosphate receptor 3
Ligand
BDBM37489
Substrate
Meas. Tech.
Dose Response Assay for S1P3 Antagonists
IC50
>49800±n/a nM
Citation
 PubChem, PC Dose Response Assay for S1P3 Antagonists PubChem Bioassay (2007)[AID] 
Target
Name:
Sphingosine 1-phosphate receptor 3
Synonyms:
C9orf108 EDG3 S1P receptor 3 S1P3 S1PR3_HUMAN Sphingosine 1-phosphate receptor 3 (S1P3) | Sphingosine 1-phosphate receptor Edg-3
Type:
G Protein-Coupled Receptor (GPCR)
Mol. Mass.:
42278.13
Organism:
Homo sapiens (Human)
Description:
Q99500
Residue:
378
  
Inhibitor
Name:
BDBM37489
Synonyms:
Cyclohexanecarboxylic acid (5-isopropyl-[1,3,4]thiadiazol-2-yl)-amide N-(5-isopropyl-1,3,4-thiadiazol-2-yl)cyclohexanecarboxamide SMR000013257 | cid_847063
Type:
Small organic molecule
Emp. Form.:
C12H19N3OS
Mol. Mass.:
253.364
SMILES:
CC(C)c1nnc(NC(=O)C2CCCCC2)s1
: