Target
Huntingtin
Ligand
BDBM37559
Substrate
Meas. Tech.
Clearance of Mutant Huntingtin Protein - Confirmatory screen
IC50
>8000±n/a nM
Citation
 PubChem, PC Clearance of Mutant Huntingtin Protein - Confirmatory screen PubChem Bioassay (2007)[AID] 
Target
Name:
Huntingtin
Synonyms:
HD HD_HUMAN Homo sapiens huntingtin (HTT), mRNA Huntington disease protein | IT15
Type:
PROTEIN
Mol. Mass.:
347579.69
Organism:
Homo sapiens (Human)
Description:
EBI_101216
Residue:
3142
  
Inhibitor
Name:
BDBM37559
Synonyms:
4-N-cyclooctyl-1-N,1-N-dimethylpiperidine-1,4-dicarboxamide N'-cyclooctyl-N,N-dimethyl-piperidine-1,4-dicarboxamide N4-cyclooctyl-N1,N1-dimethylpiperidine-1,4-dicarboxamide SMR000032110 | cid_3236588
Type:
Small organic molecule
Emp. Form.:
C17H31N3O2
Mol. Mass.:
309.4469
SMILES:
CN(C)C(=O)N1CCC(CC1)C(=O)NC1CCCCCCC1
: