Target
Huntingtin
Ligand
BDBM33604
Substrate
Meas. Tech.
Clearance of Mutant Huntingtin Protein - Confirmatory screen
IC50
>8000±n/a nM
Citation
 PubChem, PC Clearance of Mutant Huntingtin Protein - Confirmatory screen PubChem Bioassay (2007)[AID] 
Target
Name:
Huntingtin
Synonyms:
HD HD_HUMAN Homo sapiens huntingtin (HTT), mRNA Huntington disease protein | IT15
Type:
PROTEIN
Mol. Mass.:
347579.69
Organism:
Homo sapiens (Human)
Description:
EBI_101216
Residue:
3142
  
Inhibitor
Name:
BDBM33604
Synonyms:
1-(1H-imidazol-5-ylsulfonyl)-N-(4-methyl-2-pyridinyl)-3-piperidinecarboxamide 1-(1H-imidazol-5-ylsulfonyl)-N-(4-methylpyridin-2-yl)piperidine-3-carboxamide SMR000094830 | cid_5308551
Type:
Small organic molecule
Emp. Form.:
C15H19N5O3S
Mol. Mass.:
349.408
SMILES:
Cc1ccnc(NC(=O)C2CCCN(C2)S(=O)(=O)c2c[nH]cn2)c1
: