Target
Huntingtin
Ligand
BDBM37599
Substrate
Meas. Tech.
Clearance of Mutant Huntingtin Protein - Confirmatory screen
IC50
>8000±n/a nM
Citation
 PubChem, PC Clearance of Mutant Huntingtin Protein - Confirmatory screen PubChem Bioassay (2007)[AID] 
Target
Name:
Huntingtin
Synonyms:
HD HD_HUMAN Homo sapiens huntingtin (HTT), mRNA Huntington disease protein | IT15
Type:
PROTEIN
Mol. Mass.:
347579.69
Organism:
Homo sapiens (Human)
Description:
EBI_101216
Residue:
3142
  
Inhibitor
Name:
BDBM37599
Synonyms:
(4-phenyl-1-piperazinyl)-(3,4,5-triethoxyphenyl)methanone (4-phenylpiperazino)-(3,4,5-triethoxyphenyl)methanone SMR000104675 | cid_1116274
Type:
Small organic molecule
Emp. Form.:
C23H30N2O4
Mol. Mass.:
398.4953
SMILES:
CCOc1cc(cc(OCC)c1OCC)C(=O)N1CCN(CC1)c1ccccc1
: