Target
fMet-Leu-Phe receptor
Ligand
BDBM37640
Substrate
Meas. Tech.
Dose Response Assay for Formylpeptide Receptor (FPR) Ligands and Dose Response Counter-Screen Assay for Formylpeptide-Like-1 (FPRL1) Ligands
Ki
29900±n/a nM
Citation
 PubChem, PC Dose Response Assay for Formylpeptide Receptor (FPR) Ligands and Dose Response Counter-Screen Assay for Formylpeptide-Like-1 (FPRL1) Ligands PubChem Bioassay (2007)[AID] 
Target
Name:
fMet-Leu-Phe receptor
Synonyms:
FPR FPR1_HUMAN N-formyl peptide receptor 1 fMLP receptor formyl peptide receptor 1
Type:
Enzyme Catalytic Domain
Mol. Mass.:
38456.14
Organism:
Homo sapiens (Human)
Description:
gi_4503779
Residue:
350
  
Inhibitor
Name:
BDBM37640
Synonyms:
MLS000079917 N-(1-butyl-3-cyano-pyrrolo[3,2-b]quinoxalin-2-yl)acetamide N-(1-butyl-3-cyanopyrrolo[3,2-b]quinoxalin-2-yl)acetamide US9045483, 4 | cid_658861
Type:
Small organic molecule
Emp. Form.:
C17H17N5O
Mol. Mass.:
307.3498
SMILES:
CCCCn1c(NC(C)=O)c(C#N)c2nc3ccccc3nc12
: