Target
fMet-Leu-Phe receptor
Ligand
BDBM37633
Substrate
Meas. Tech.
Dose Response Assay for Formylpeptide Receptor (FPR) Ligands and Dose Response Counter-Screen Assay for Formylpeptide-Like-1 (FPRL1) Ligands
IC50
>66700±n/a nM
Citation
 PubChem, PC Dose Response Assay for Formylpeptide Receptor (FPR) Ligands and Dose Response Counter-Screen Assay for Formylpeptide-Like-1 (FPRL1) Ligands PubChem Bioassay (2007)[AID] 
Target
Name:
fMet-Leu-Phe receptor
Synonyms:
FPR FPR1_HUMAN N-formyl peptide receptor 1 fMLP receptor formyl peptide receptor 1
Type:
Enzyme Catalytic Domain
Mol. Mass.:
38456.14
Organism:
Homo sapiens (Human)
Description:
gi_4503779
Residue:
350
  
Inhibitor
Name:
BDBM37633
Synonyms:
(2S)-2-amino-3-(4-hydroxy-3-iodo-phenyl)propionic acid (2S)-2-azanyl-3-(3-iodanyl-4-oxidanyl-phenyl)propanoic acid 3-Iodo-L-tyrosine (I-Tyr) Monoiodotyrosine cid_439744
Type:
Small organic molecule
Emp. Form.:
C9H10INO3
Mol. Mass.:
307.0851
SMILES:
N[C@@H](Cc1ccc(O)c(I)c1)C(O)=O
: