Target
fMet-Leu-Phe receptor
Ligand
BDBM50022309
Substrate
Meas. Tech.
Dose Response Assay for Formylpeptide Receptor (FPR) Ligands and Dose Response Counter-Screen Assay for Formylpeptide-Like-1 (FPRL1) Ligands
IC50
5300±n/a nM
Citation
 PubChem, PC Dose Response Assay for Formylpeptide Receptor (FPR) Ligands and Dose Response Counter-Screen Assay for Formylpeptide-Like-1 (FPRL1) Ligands PubChem Bioassay (2007)[AID] 
Target
Name:
fMet-Leu-Phe receptor
Synonyms:
FPR FPR1_HUMAN N-formyl peptide receptor 1 fMLP receptor formyl peptide receptor 1
Type:
Enzyme Catalytic Domain
Mol. Mass.:
38456.14
Organism:
Homo sapiens (Human)
Description:
gi_4503779
Residue:
350
  
Inhibitor
Name:
BDBM50022309
Synonyms:
3,5-Dioxo-1,2-diphenyl-4-n-butylpyrazolidine 4-n-Butyl-1,2-diphenyl-3,5-pyrazolidinedione PHENYLBUTAZONE | Phenylbutazon
Type:
Small organic molecule
Emp. Form.:
C19H20N2O2
Mol. Mass.:
308.3743
SMILES:
CCCCc1c(O)n(-c2ccccc2)n(-c2ccccc2)c1=O
: