Target
Cytochrome P450 11B2, mitochondrial
Ligand
BDBM101358
Substrate
Meas. Tech.
Cellular Enzyme Assay
Temperature
310.15±n/a K
EC50
352±n/a nM
Comments
extracted
Citation
 Aebi, JAmrein, KChen, WHornsperger, BKuhn, BLiu, YMaerki, HPMartin, REMayweg, ATan, XWang, LZhou, M 3,4-dihydro-2H-isoquinoline-1-one and 2,3-dihydro-isoindol-1-one compounds US Patent  US9695151 Publication Date 7/4/2017 
Target
Name:
Cytochrome P450 11B2, mitochondrial
Synonyms:
Aldosterone Synthase (CYP11B2) Aldosterone-synthesizing enzyme CYP11B2 Cytochrome P450 11B2 Cytochrome P450 11B2, mitochondrial P-450C18 | Steroid 18-hydroxylase
Type:
Protein
Mol. Mass.:
57582.15
Organism:
Homo sapiens (Human)
Description:
P19099
Residue:
503
  
Inhibitor
Name:
BDBM101358
Synonyms:
US9695151, 24 | US9695151, 25
Type:
Small organic molecule
Emp. Form.:
C22H27ClN4O3S
Mol. Mass.:
462.993
SMILES:
CCS(=O)(=O)N1CCCC(C1)Nc1cncc(c1)N1C(=O)c2ccc(Cl)cc2C1(C)C
: