Target
Plasminogen activator inhibitor 1/Urokinase-type plasminogen activator
Ligand
BDBM264552
Substrate
Meas. Tech.
Fluorometric PAI-1/uPA IC50 Plate Assay (1.5% BSA buffer)
pH
7.4±n/a
Temperature
298.15±n/a K
IC50
294000±n/a nM
Comments
extracted
Citation
 Lawrence, DAEmal, CReinke, ALi, SWarnock, MAbernathy, G Plasminogen activator inhibitor-1 inhibitors and methods of use thereof US Patent  US9718760 Publication Date 8/1/2017 
Target
Name:
Plasminogen activator inhibitor 1/Urokinase-type plasminogen activator
Synonyms:
PAI-1/uPA
Type:
Enzyme
Mol. Mass.:
Description:
Components:
This complex has 2 components.
Component 1
Name:
Plasminogen activator inhibitor 1
Synonyms:
Endothelial plasminogen activator inhibitor PAI-1 PAI1_HUMAN Plasminogen activator inhibitor 1 Plasminogen activator inhibitor-1 SERPINE1
Type:
Enzyme
Mol. Mass.:
45064.00
Organism:
Homo sapiens (Human)
Description:
P05121
Residue:
402
  
Component 2
Name:
Urokinase-type plasminogen activator
Synonyms:
PLAU UROK_HUMAN Urokinase-type plasminogen activator (uPA) | Urokinase-type plasminogen activator/surface receptor
Type:
Enzyme
Mol. Mass.:
48528.62
Organism:
Homo sapiens (Human)
Description:
P00749
Residue:
431
  
Inhibitor
Name:
BDBM264552
Synonyms:
US9718760, C260
Type:
Small organic molecule
Emp. Form.:
C9H10BrN3O2
Mol. Mass.:
272.099
SMILES:
NNC(=O)C(=O)NCc1ccc(Br)cc1
: