Target
Plasminogen activator inhibitor 1/Tissue-type plasminogen activator
Ligand
BDBM264627
Substrate
Meas. Tech.
Fluorometric PAI-1/tPA IC50 Plate Assay at pH 7.8
Temperature
298.15±n/a K
IC50
58160±n/a nM
Comments
extracted
Citation
 Lawrence, DAEmal, CReinke, ALi, SWarnock, MAbernathy, G Plasminogen activator inhibitor-1 inhibitors and methods of use thereof US Patent  US9718760 Publication Date 8/1/2017 
Target
Name:
Plasminogen activator inhibitor 1/Tissue-type plasminogen activator
Synonyms:
PAI-1/tPA
Type:
Enzyme
Mol. Mass.:
Description:
Components:
This complex has 2 components.
Component 1
Name:
Plasminogen activator inhibitor 1
Synonyms:
Endothelial plasminogen activator inhibitor PAI-1 PAI1_HUMAN Plasminogen activator inhibitor 1 Plasminogen activator inhibitor-1 SERPINE1
Type:
Enzyme
Mol. Mass.:
45064.00
Organism:
Homo sapiens (Human)
Description:
P05121
Residue:
402
  
Component 2
Name:
Tissue-type plasminogen activator
Synonyms:
Alteplase Reteplase Thrombin receptor protein Tissue-type plasminogen activator (tPA) t-PA t-plasminogen activator
Type:
Enzyme
Mol. Mass.:
62931.08
Organism:
Homo sapiens (Human)
Description:
Residue:
562
  
Inhibitor
Name:
BDBM264627
Synonyms:
US9718760, C160
Type:
Small organic molecule
Emp. Form.:
C13H13NO4S
Mol. Mass.:
279.312
SMILES:
Oc1ccc(cc1O)S(=O)(=O)NCc1ccccc1
: