Target
Plasminogen activator inhibitor 1/Urokinase-type plasminogen activator
Ligand
BDBM264635
Substrate
Meas. Tech.
Fluorometric PAI-1/uPA IC50 Plate Assay
pH
7.4±n/a
Temperature
298.15±n/a K
IC50
1820±n/a nM
Comments
extracted
Citation
 Lawrence, DAEmal, CReinke, ALi, SWarnock, MAbernathy, G Plasminogen activator inhibitor-1 inhibitors and methods of use thereof US Patent  US9718760 Publication Date 8/1/2017 
Target
Name:
Plasminogen activator inhibitor 1/Urokinase-type plasminogen activator
Synonyms:
PAI-1/uPA
Type:
Enzyme
Mol. Mass.:
Description:
Components:
This complex has 2 components.
Component 1
Name:
Plasminogen activator inhibitor 1
Synonyms:
Endothelial plasminogen activator inhibitor PAI-1 PAI1_HUMAN Plasminogen activator inhibitor 1 Plasminogen activator inhibitor-1 SERPINE1
Type:
Enzyme
Mol. Mass.:
45064.00
Organism:
Homo sapiens (Human)
Description:
P05121
Residue:
402
  
Component 2
Name:
Urokinase-type plasminogen activator
Synonyms:
3.4.21.73 U-plasminogen activator Urokinase Urokinase-type plasminogen activator chain B Urokinase-type plasminogen activator short chain A uPA
Type:
Enzyme
Mol. Mass.:
48528.62
Organism:
Homo sapiens (Human)
Description:
P00749
Residue:
431
  
Inhibitor
Name:
BDBM264635
Synonyms:
US9718760, C271
Type:
Small organic molecule
Emp. Form.:
C12H17NO6S
Mol. Mass.:
303.331
SMILES:
OC(=O)CCCCCNS(=O)(=O)c1ccc(O)c(O)c1
: