Target
Free fatty acid receptor 4
Ligand
BDBM403693
Substrate
Meas. Tech.
GPR120 pERK AlphaScreen SureFire Assay
EC50
750±n/a nM
Citation
 Cheng, PTYoon, DS Phenyl-(aza)cycloalkyl carboxylic acid GPR120 modulators US Patent  US10336684 Publication Date 7/2/2019 
Target
Name:
Free fatty acid receptor 4
Synonyms:
FFAR4 G-protein coupled receptor 120 G-protein coupled receptor GT01 GPR120 O3FAR1 PGR4
Type:
PROTEIN
Mol. Mass.:
42256.91
Organism:
Homo sapiens (Human)
Description:
ChEMBL_1508994
Residue:
377
  
Inhibitor
Name:
BDBM403693
Synonyms:
2-(4-(3-Phenoxycycloheptyl)phenethoxy)acetic acid (diastereomeric mixture) US10336684, Example 15 US10336684, Example 17
Type:
Small organic molecule
Emp. Form.:
C23H28O4
Mol. Mass.:
368.466
SMILES:
OC(=O)COCCc1ccc(cc1)C1CCCCC(C1)Oc1ccccc1
: