Target
Free fatty acid receptor 4
Ligand
BDBM403700
Substrate
Meas. Tech.
GPR120 pERK AlphaScreen SureFire Assay
EC50
2420±n/a nM
Citation
 Cheng, PTYoon, DS Phenyl-(aza)cycloalkyl carboxylic acid GPR120 modulators US Patent  US10336684 Publication Date 7/2/2019 
Target
Name:
Free fatty acid receptor 4
Synonyms:
FFAR4 G-protein coupled receptor 120 G-protein coupled receptor GT01 GPR120 O3FAR1 PGR4
Type:
PROTEIN
Mol. Mass.:
42256.91
Organism:
Homo sapiens (Human)
Description:
ChEMBL_1508994
Residue:
377
  
Inhibitor
Name:
BDBM403700
Synonyms:
2-(4-(3-Phenoxypiperidin-1-yl)phenethoxy)acetic acid | US10336684, Example 21
Type:
Small organic molecule
Emp. Form.:
C21H25NO4
Mol. Mass.:
355.4275
SMILES:
OC(=O)COCCc1ccc(cc1)N1CCCC(C1)Oc1ccccc1
: