Target
N-formyl peptide receptor 2
Ligand
BDBM37744
Substrate
Meas. Tech.
Dose Response Assay for Formylpeptide Receptor-Like-1 (FPRL1) Ligands and Dose Response Counter-Screen Assay for Formylpeptide Receptor (FPR) Ligands
Ki
>40300±n/a nM
Comments
Extracted from aid = 520 and tid = 2
Citation
 PubChem, PC Dose Response Assay for Formylpeptide Receptor-Like-1 (FPRL1) Ligands and Dose Response Counter-Screen Assay for Formylpeptide Receptor (FPR) Ligands PubChem Bioassay (2007)[AID] 
Target
Name:
N-formyl peptide receptor 2
Synonyms:
ALXR, FPRL1, FPR2 FPR2 FPRH1 Formyl Peptide Receptor-Like 1 LXA4 receptor Lipoxin A4 receptor RFP | hFPRL
Type:
G Protein-Coupled Receptor (GPCR)
Mol. Mass.:
38968.35
Organism:
Homo sapiens (Human)
Description:
P25090
Residue:
351
  
Inhibitor
Name:
BDBM37744
Synonyms:
3-[2-(N-ethyl-2,5-dimethoxy-anilino)-2-keto-ethyl]-1H-indole-2-carboxylic acid 3-[2-[(2,5-dimethoxyphenyl)-ethyl-amino]-2-oxidanylidene-ethyl]-1H-indole-2-carboxylic acid MLS000044758 cid_3244340
Type:
Small organic molecule
Emp. Form.:
C21H22N2O5
Mol. Mass.:
382.4098
SMILES:
CCN(C(=O)Cc1c([nH]c2ccccc12)C(O)=O)c1cc(OC)ccc1OC
: