Target
N-formyl peptide receptor 2
Ligand
BDBM37692
Substrate
Meas. Tech.
Dose Response Assay for Formylpeptide Receptor-Like-1 (FPRL1) Ligands and Dose Response Counter-Screen Assay for Formylpeptide Receptor (FPR) Ligands
IC50
15000±n/a nM
Comments
Extracted from aid = 520 and tid = 3
Citation
 PubChem, PC Dose Response Assay for Formylpeptide Receptor-Like-1 (FPRL1) Ligands and Dose Response Counter-Screen Assay for Formylpeptide Receptor (FPR) Ligands PubChem Bioassay (2007)[AID] 
Target
Name:
N-formyl peptide receptor 2
Synonyms:
ALXR, FPRL1, FPR2 FPR2 FPRH1 Formyl Peptide Receptor-Like 1 LXA4 receptor Lipoxin A4 receptor RFP | hFPRL
Type:
G Protein-Coupled Receptor (GPCR)
Mol. Mass.:
38968.35
Organism:
Homo sapiens (Human)
Description:
P25090
Residue:
351
  
Inhibitor
Name:
BDBM37692
Synonyms:
(2-aminophenyl)-(4-aminophenyl)amine MLS000084680 SMR000015718 | cid_774866
Type:
Small organic molecule
Emp. Form.:
C12H13N3
Mol. Mass.:
199.2517
SMILES:
Nc1ccc(Nc2ccccc2N)cc1
: