Target
N-formyl peptide receptor 2
Ligand
BDBM37746
Substrate
Meas. Tech.
Dose Response Assay for Formylpeptide Receptor-Like-1 (FPRL1) Ligands and Dose Response Counter-Screen Assay for Formylpeptide Receptor (FPR) Ligands
IC50
45000±n/a nM
Comments
Extracted from aid = 520 and tid = 3
Citation
 PubChem, PC Dose Response Assay for Formylpeptide Receptor-Like-1 (FPRL1) Ligands and Dose Response Counter-Screen Assay for Formylpeptide Receptor (FPR) Ligands PubChem Bioassay (2007)[AID] 
Target
Name:
N-formyl peptide receptor 2
Synonyms:
ALXR, FPRL1, FPR2 FPR2 FPRH1 Formyl Peptide Receptor-Like 1 LXA4 receptor Lipoxin A4 receptor RFP | hFPRL
Type:
G Protein-Coupled Receptor (GPCR)
Mol. Mass.:
38968.35
Organism:
Homo sapiens (Human)
Description:
P25090
Residue:
351
  
Inhibitor
Name:
BDBM37746
Synonyms:
MLS000045943 N-(5-imidazo[1,2-a]pyrimidin-2-yl-2-methoxy-phenyl)-3-methyl-butyramide N-[5-(2-imidazo[1,2-a]pyrimidinyl)-2-methoxyphenyl]-3-methylbutanamide cid_3244709
Type:
Small organic molecule
Emp. Form.:
C18H20N4O2
Mol. Mass.:
324.377
SMILES:
COc1ccc(cc1NC(=O)CC(C)C)-c1cn2cccnc2n1
: