Target
cAMP-dependent protein kinase catalytic subunit alpha
Ligand
BDBM50182878
Substrate
Meas. Tech.
Dose-response biochemical assay for inhibitors of protein kinase A (PKA) activity
IC50
11330±n/a nM
Citation
 PubChem, PC Dose-response biochemical assay for inhibitors of protein kinase A (PKA) activity PubChem Bioassay (2007)[AID] 
Target
Name:
cAMP-dependent protein kinase catalytic subunit alpha
Synonyms:
KAPCA_HUMAN PKACA cAMP-dependent protein kinase (PKA) cAMP-dependent protein kinase catalytic subunit alpha cAMP-dependent protein kinase catalytic subunit alpha (PKACA) cAMP-dependent protein kinase catalytic subunit alpha isoform 1 | cAMP-dependent protein kinase, alpha-catalytic subunit
Type:
Enzyme Catalytic Subunit
Mol. Mass.:
40598.73
Organism:
Homo sapiens (Human)
Description:
Residue:
351
  
Inhibitor
Name:
BDBM50182878
Synonyms:
3-(pyridin-4-yl)-1H-indole cid_644354
Type:
Small organic molecule
Emp. Form.:
C13H10N2
Mol. Mass.:
194.2319
SMILES:
c1[nH]c2ccccc2c1-c1ccncc1
: